BDBM50001994 2-{4-[1-(4-Fluoro-phenyl)-5-trifluoromethyl-1H-indol-3-yl]-piperazin-1-yl}-ethanol::CHEMBL12843
SMILES OCCN1CCN(CC1)c1cn(-c2ccc(F)cc2)c2ccc(cc12)C(F)(F)F
InChI Key InChIKey=NCZRXRGIUPSHIH-UHFFFAOYSA-N
Data  2 IC50
  Tab Delimited (TSV)   2D SDfile   Computed 3D by Vconf -m prep SDfile
Find this compound or compounds like it in BindingDB:
Activity Spreadsheet -- Enzyme Inhibition Constant Data from BindingDB
Found 1 hit for monomerid = 50001994
TargetD(2) dopamine receptor(Rattus norvegicus (rat))
H. Lundbeck
Curated by ChEMBL
LigandPNGBDBM50001994(2-{4-[1-(4-Fluoro-phenyl)-5-trifluoromethyl-1H-ind...)
Affinity DataIC50:  2.60nM. Assay description: Tested for the inhibition of [3H]-spiperone binding to dopamine D2 receptor
In DepthDetails ArticlePubMed